{"text_format":"1","workbook":"xlsx","n_sheets":8,"sheets":["Instruções","Retorno dividendos 2016-2021","Retorno dividendos por segmento","Renda de R$ 1.000 por mês","Monte uma carteira de FIIs","Confira os resultados","Sheet1","Lista"],"not_rendered":{"charts":1,"images":0,"macros":1,"external_links":0,"defined_names":11,"comments":0,"pivot_tables":0},"unopened":[],"bounds":{"document_bytes":16777216,"sheet_cells":100000,"rows_first":2000,"rows_last":500,"rows_between":2000,"halvings":0,"cell_chars":16384,"cell_head_chars":4096},"cells_cut":0,"cells_raw":0,"read":"whole","date_system":"1900"}

{"sheet":"Instruções","index":0,"n_rows":0,"n_cols":0,"rows_kept":0,"cut":false,"hidden":false,"merged":[]}

{"sheet":"Retorno dividendos 2016-2021","index":1,"n_rows":97,"n_cols":9,"rows_kept":97,"cut":false,"hidden":false,"merged":[]}
["Código do fundo","Nome do fundo","Segmento","Retorno com dividendos\nJun 16 - Jun 17 (% ao ano)","Retorno com dividendos\nJun 17 - Jun 18  (% ao ano)","Retorno com dividendos\nJun 18 - Jun 19  (% ao ano)","Retorno com dividendos\nJun 19 - Jun 20  (% ao ano)","Retorno com dividendos\nJun 20 - Jun 21  (% ao ano)","Taxa Média\nJun 16 - Jun 21  (% ao ano)"]
["ABCP11","GRAND PLAZA SHOPPING FII ","Shoppings",5.6060606059999997E-2,6.9236111109999998E-2,5.0233966419999998E-2,5.3013962990000003E-2,4.7046902139999999E-2,{"$f":"IFERROR(AVERAGE(D2:H2),0)","v":5.5118309743999991E-2}]
["ALZR11","ALIANZA TRUST RENDA IMOBILIÁRIA FII ","Híbrido","-","-",7.5101816949999997E-2,4.7416945180000003E-2,5.3170138409999998E-2,5.8562966846666668E-2]
["BARI11","BARIGUI RENDIMENTOS IMOBILIÁRIOS I FII ","Recebíveis","-","-","-","-",0.1357894737,0.1357894737]
["BBFI11B","BB PROGRESSIVO FII ","Lajes Corporativas",0.1015258123,0.13324499710000001,9.9584406530000003E-2,0.11382720759999999,0.1197869924,0.11359388318599999]
["BBPO11","BB PROGRESSIVO II FII ","Agências",8.5845440689999997E-2,9.5922262580000001E-2,8.3633841099999995E-2,7.7004052439999998E-2,0.1124062566,9.0962370681999999E-2]
["BCFF11","BTG PACTUAL FUNDO DE FUNDOS FII ","Fundo de Fundos",9.2976246360000001E-2,7.7937553490000006E-2,7.0925159409999994E-2,6.5281958400000006E-2,7.6492340680000007E-2,7.6722651667999991E-2]
["BCIA11","BRADESCO CARTEIRA IMOBILIÁRIA ATIVA FII ","Fundo de Fundos",9.4003737680000005E-2,7.7767441859999994E-2,7.2699207340000002E-2,7.9078292750000001E-2,8.3371514709999997E-2,8.1384038867999997E-2]
["BCRI11","BANESTES RECEBÍVEIS IMOBILIÁRIOS FII ","Recebíveis",0.1100588086,7.889432767E-2,8.3416887450000005E-2,8.4095322589999993E-2,0.10977539629999999,9.3248148521999988E-2]
["BPFF11","BRASIL PLURAL ABSOLUTO FUNDO DE FUNDOS FII ","Fundo de Fundos",8.8529886909999994E-2,9.0593505039999994E-2,7.9376776499999996E-2,9.2505506409999994E-2,8.4699095320000001E-2,8.7140954036000001E-2]
{"$rows_left_out":88}
{"sheet":"Retorno dividendos por segmento","index":2,"n_rows":12,"n_cols":8,"rows_kept":12,"cut":false,"hidden":false,"merged":[]}
["Segmento dos FIIs","Retorno com dividendos\nJun 16 - Jun 17 (% ao ano)","Retorno com dividendos\nJun 17 - Jun 18  (% ao ano)","Retorno com dividendos\nJun 18 - Jun 19  (% ao ano)","Retorno com dividendos\nJun 19 - Jun 20  (% ao ano)","Retorno com dividendos\nJun 20 - Jun 21  (% ao ano)","Taxa Média\nJun 16 - Jun 21  (% ao ano)","Quantidade de fundos"]
["Shoppings",{"$f":"IFERROR(AVERAGEIF('Retorno dividendos 2016-2021'!$C:$C,'Retorno dividendos por segmento'!$A2,'Retorno dividendos 2016-2021'!D:D),\"-\")","v":8.6581987713333322E-2},{"$f":"IFERROR(AVERAGEIF('Retorno dividendos 2016-2021'!$C:$C,'Retorno dividendos por segmento'!$A2,'Retorno dividendos 2016-2021'!E:E),\"-\")","v":9.4447243166666681E-2},{"$f":"IFERROR(AVERAGEIF('Retorno dividendos 2016-2021'!$C:$C,'Retorno dividendos por segmento'!$A2,'Retorno dividendos 2016-2021'!F:F),\"-\")","v":7.3752369463333328E-2},{"$f":"IFERROR(AVERAGEIF('Retorno dividendos 2016-2021'!$C:$C,'Retorno dividendos por segmento'!$A2,'Retorno dividendos 2016-2021'!G:G),\"-\")","v":5.8724240279999999E-2},{"$f":"IFERROR(AVERAGEIF('Retorno dividendos 2016-2021'!$C:$C,'Retorno dividendos por segmento'!$A2,'Retorno dividendos 2016-2021'!H:H),\"-\")","v":4.0319836858571427E-2},{"$f":"AVERAGE(B2:F2)","v":7.0765135496380943E-2},{"$f":"COUNTIF('Retorno dividendos 2016-2021'!C:C,'Retorno dividendos por segmento'!A2)","v":7}]
["Híbrido",{"$f":"IFERROR(AVERAGEIF('Retorno dividendos 2016-2021'!$C:$C,'Retorno dividendos por segmento'!$A3,'Retorno dividendos 2016-2021'!D:D),\"-\")","v":8.0651738736666659E-2},{"$f":"IFERROR(AVERAGEIF('Retorno dividendos 2016-2021'!$C:$C,'Retorno dividendos por segmento'!$A3,'Retorno dividendos 2016-2021'!E:E),\"-\")","v":8.3609639260000007E-2},{"$f":"IFERROR(AVERAGEIF('Retorno dividendos 2016-2021'!$C:$C,'Retorno dividendos por segmento'!$A3,'Retorno dividendos 2016-2021'!F:F),\"-\")","v":6.2162865205714284E-2},{"$f":"IFERROR(AVERAGEIF('Retorno dividendos 2016-2021'!$C:$C,'Retorno dividendos por segmento'!$A3,'Retorno dividendos 2016-2021'!G:G),\"-\")","v":6.1270868643333344E-2},{"$f":"IFERROR(AVERAGEIF('Retorno dividendos 2016-2021'!$C:$C,'Retorno dividendos por segmento'!$A3,'Retorno dividendos 2016-2021'!H:H),\"-\")","v":9.0922436482307703E-2},7.5723509665604399E-2,{"$f":"COUNTIF('Retorno dividendos 2016-2021'!C:C,'Retorno dividendos por segmento'!A3)","v":13}]
["Recebíveis",{"$f":"IFERROR(AVERAGEIF('Retorno dividendos 2016-2021'!$C:$C,'Retorno dividendos por segmento'!$A4,'Retorno dividendos 2016-2021'!D:D),\"-\")","v":0.1194454895},{"$f":"IFERROR(AVERAGEIF('Retorno dividendos 2016-2021'!$C:$C,'Retorno dividendos por segmento'!$A4,'Retorno dividendos 2016-2021'!E:E),\"-\")","v":8.1290084116250008E-2},{"$f":"IFERROR(AVERAGEIF('Retorno dividendos 2016-2021'!$C:$C,'Retorno dividendos por segmento'!$A4,'Retorno dividendos 2016-2021'!F:F),\"-\")","v":8.3266775054545439E-2},{"$f":"IFERROR(AVERAGEIF('Retorno dividendos 2016-2021'!$C:$C,'Retorno dividendos por segmento'!$A4,'Retorno dividendos 2016-2021'!G:G),\"-\")","v":7.9964898863571429E-2},{"$f":"IFERROR(AVERAGEIF('Retorno dividendos 2016-2021'!$C:$C,'Retorno dividendos por segmento'!$A4,'Retorno dividendos 2016-2021'!H:H),\"-\")","v":9.6665374594814835E-2},9.212652442583634E-2,{"$f":"COUNTIF('Retorno dividendos 2016-2021'!C:C,'Retorno dividendos por segmento'!A4)","v":27}]
["Fundo de Fundos",{"$f":"IFERROR(AVERAGEIF('Retorno dividendos 2016-2021'!$C:$C,'Retorno dividendos por segmento'!$A5,'Retorno dividendos 2016-2021'!D:D),\"-\")","v":9.1120772682500004E-2},{"$f":"IFERROR(AVERAGEIF('Retorno dividendos 2016-2021'!$C:$C,'Retorno dividendos por segmento'!$A5,'Retorno dividendos 2016-2021'!E:E),\"-\")","v":8.2264711357499992E-2},{"$f":"IFERROR(AVERAGEIF('Retorno dividendos 2016-2021'!$C:$C,'Retorno dividendos por segmento'!$A5,'Retorno dividendos 2016-2021'!F:F),\"-\")","v":7.7347773930000002E-2},{"$f":"IFERROR(AVERAGEIF('Retorno dividendos 2016-2021'!$C:$C,'Retorno dividendos por segmento'!$A5,'Retorno dividendos 2016-2021'!G:G),\"-\")","v":8.0965177648749997E-2},{"$f":"IFERROR(AVERAGEIF('Retorno dividendos 2016-2021'!$C:$C,'Retorno dividendos por segmento'!$A5,'Retorno dividendos 2016-2021'!H:H),\"-\")","v":8.4951157239999991E-2},8.3329918571750011E-2,{"$f":"COUNTIF('Retorno dividendos 2016-2021'!C:C,'Retorno dividendos por segmento'!A5)","v":13}]
["Lajes Corporativas",{"$f":"IFERROR(AVERAGEIF('Retorno dividendos 2016-2021'!$C:$C,'Retorno dividendos por segmento'!$A6,'Retorno dividendos 2016-2021'!D:D),\"-\")","v":9.2015948754444452E-2},{"$f":"IFERROR(AVERAGEIF('Retorno dividendos 2016-2021'!$C:$C,'Retorno dividendos por segmento'!$A6,'Retorno dividendos 2016-2021'!E:E),\"-\")","v":8.4091127408888883E-2},{"$f":"IFERROR(AVERAGEIF('Retorno dividendos 2016-2021'!$C:$C,'Retorno dividendos por segmento'!$A6,'Retorno dividendos 2016-2021'!F:F),\"-\")","v":7.9682913807777783E-2},{"$f":"IFERROR(AVERAGEIF('Retorno dividendos 2016-2021'!$C:$C,'Retorno dividendos por segmento'!$A6,'Retorno dividendos 2016-2021'!G:G),\"-\")","v":7.4652206679166666E-2},{"$f":"IFERROR(AVERAGEIF('Retorno dividendos 2016-2021'!$C:$C,'Retorno dividendos por segmento'!$A6,'Retorno dividendos 2016-2021'!H:H),\"-\")","v":8.9645096738666649E-2},8.4017458677788898E-2,{"$f":"COUNTIF('Retorno dividendos 2016-2021'!C:C,'Retorno dividendos por segmento'!A6)","v":15}]
["Logística",{"$f":"IFERROR(AVERAGEIF('Retorno dividendos 2016-2021'!$C:$C,'Retorno dividendos por segmento'!$A7,'Retorno dividendos 2016-2021'!D:D),\"-\")","v":8.1415668375E-2},{"$f":"IFERROR(AVERAGEIF('Retorno dividendos 2016-2021'!$C:$C,'Retorno dividendos por segmento'!$A7,'Retorno dividendos 2016-2021'!E:E),\"-\")","v":7.5195090320000005E-2},{"$f":"IFERROR(AVERAGEIF('Retorno dividendos 2016-2021'!$C:$C,'Retorno dividendos por segmento'!$A7,'Retorno dividendos 2016-2021'!F:F),\"-\")","v":6.4417566927142858E-2},{"$f":"IFERROR(AVERAGEIF('Retorno dividendos 2016-2021'!$C:$C,'Retorno dividendos por segmento'!$A7,'Retorno dividendos 2016-2021'!G:G),\"-\")","v":6.2380195689090916E-2},{"$f":"IFERROR(AVERAGEIF('Retorno dividendos 2016-2021'!$C:$C,'Retorno dividendos por segmento'!$A7,'Retorno dividendos 2016-2021'!H:H),\"-\")","v":6.6966181617333323E-2},7.0074940585713424E-2,{"$f":"COUNTIF('Retorno dividendos 2016-2021'!C:C,'Retorno dividendos por segmento'!A7)","v":15}]
["Hotel",{"$f":"IFERROR(AVERAGEIF('Retorno dividendos 2016-2021'!$C:$C,'Retorno dividendos por segmento'!$A8,'Retorno dividendos 2016-2021'!D:D),\"-\")","v":5.4271705650000002E-2},{"$f":"IFERROR(AVERAGEIF('Retorno dividendos 2016-2021'!$C:$C,'Retorno dividendos por segmento'!$A8,'Retorno dividendos 2016-2021'!E:E),\"-\")","v":6.1339619839999998E-2},{"$f":"IFERROR(AVERAGEIF('Retorno dividendos 2016-2021'!$C:$C,'Retorno dividendos por segmento'!$A8,'Retorno dividendos 2016-2021'!F:F),\"-\")","v":5.5681057970000003E-2},{"$f":"IFERROR(AVERAGEIF('Retorno dividendos 2016-2021'!$C:$C,'Retorno dividendos por segmento'!$A8,'Retorno dividendos 2016-2021'!G:G),\"-\")","v":4.9512338509999997E-2},{"$f":"IFERROR(AVERAGEIF('Retorno dividendos 2016-2021'!$C:$C,'Retorno dividendos por segmento'!$A8,'Retorno dividendos 2016-2021'!H:H),\"-\")","v":0},4.4160944394E-2,{"$f":"COUNTIF('Retorno dividendos 2016-2021'!C:C,'Retorno dividendos por segmento'!A8)","v":1}]
["Educacional",{"$f":"IFERROR(AVERAGEIF('Retorno dividendos 2016-2021'!$C:$C,'Retorno dividendos por segmento'!$A9,'Retorno dividendos 2016-2021'!D:D),\"-\")","v":9.4674151149999997E-2},{"$f":"IFERROR(AVERAGEIF('Retorno dividendos 2016-2021'!$C:$C,'Retorno dividendos por segmento'!$A9,'Retorno dividendos 2016-2021'!E:E),\"-\")","v":9.4098984770000005E-2},{"$f":"IFERROR(AVERAGEIF('Retorno dividendos 2016-2021'!$C:$C,'Retorno dividendos por segmento'!$A9,'Retorno dividendos 2016-2021'!F:F),\"-\")","v":8.0437158470000006E-2},{"$f":"IFERROR(AVERAGEIF('Retorno dividendos 2016-2021'!$C:$C,'Retorno dividendos por segmento'!$A9,'Retorno dividendos 2016-2021'!G:G),\"-\")","v":6.613054954E-2},{"$f":"IFERROR(AVERAGEIF('Retorno dividendos 2016-2021'!$C:$C,'Retorno dividendos por segmento'!$A9,'Retorno dividendos 2016-2021'!H:H),\"-\")","v":8.5878771539999996E-2},8.4243923094000001E-2,{"$f":"COUNTIF('Retorno dividendos 2016-2021'!C:C,'Retorno dividendos por segmento'!A9)","v":1}]
["Agências",{"$f":"IFERROR(AVERAGEIF('Retorno dividendos 2016-2021'!$C:$C,'Retorno dividendos por segmento'!$A10,'Retorno dividendos 2016-2021'!D:D),\"-\")","v":8.1723759690000009E-2},{"$f":"IFERROR(AVERAGEIF('Retorno dividendos 2016-2021'!$C:$C,'Retorno dividendos por segmento'!$A10,'Retorno dividendos 2016-2021'!E:E),\"-\")","v":9.1498867139999995E-2},{"$f":"IFERROR(AVERAGEIF('Retorno dividendos 2016-2021'!$C:$C,'Retorno dividendos por segmento'!$A10,'Retorno dividendos 2016-2021'!F:F),\"-\")","v":7.6080121685000002E-2},{"$f":"IFERROR(AVERAGEIF('Retorno dividendos 2016-2021'!$C:$C,'Retorno dividendos por segmento'!$A10,'Retorno dividendos 2016-2021'!G:G),\"-\")","v":7.7296555870000005E-2},{"$f":"IFERROR(AVERAGEIF('Retorno dividendos 2016-2021'!$C:$C,'Retorno dividendos por segmento'!$A10,'Retorno dividendos 2016-2021'!H:H),\"-\")","v":0.10268061808000001},8.5855984492999998E-2,{"$f":"COUNTIF('Retorno dividendos 2016-2021'!C:C,'Retorno dividendos por segmento'!A10)","v":2}]
{"$rows_left_out":3}
{"sheet":"Renda de R$ 1.000 por mês","index":3,"n_rows":97,"n_cols":7,"rows_kept":97,"cut":false,"hidden":false,"merged":[]}
["Código do fundo","Nome do fundo","Segmento","Retorno com dividendos\nJun 20 - Jun 21 (% ao ano)","Investimento necessário para obter renda mensal de R$ 1.000 (Jun 20 - Jun 21)","Retorno com dividendos\nJun 16 - Jun 21 (% ao ano)","Investimento necessário para obter renda mensal de R$ 1.000 (Jun 16 - Jun 21)"]
["ABCP11","GRAND PLAZA SHOPPING FII ","Shoppings",{"$f":"VLOOKUP(A2,'Retorno dividendos 2016-2021'!A:I,8,0)","v":4.7046902139999999E-2},{"$f":"IFERROR(12000/D2,0)","v":255064.61539786306},{"$f":"VLOOKUP(A2,'Retorno dividendos 2016-2021'!A:I,9,0)","v":5.5118309743999991E-2},{"$f":"IFERROR(12000/F2,0)","v":217713.49766955222}]
["ALZR11","ALIANZA TRUST RENDA IMOBILIÁRIA FII ","Híbrido",{"$f":"VLOOKUP(A3,'Retorno dividendos 2016-2021'!A:I,8,0)","v":5.3170138409999998E-2},225690.59172776376,{"$f":"VLOOKUP(A3,'Retorno dividendos 2016-2021'!A:I,9,0)","v":5.8562966846666668E-2},204907.6514757043]
["BARI11","BARIGUI RENDIMENTOS IMOBILIÁRIOS I FII ","Recebíveis",{"$f":"VLOOKUP(A4,'Retorno dividendos 2016-2021'!A:I,8,0)","v":0.1357894737},88372.093012979996,{"$f":"VLOOKUP(A4,'Retorno dividendos 2016-2021'!A:I,9,0)","v":0.1357894737},88372.093012979996]
["BBFI11B","BB PROGRESSIVO FII ","Lajes Corporativas",{"$f":"VLOOKUP(A5,'Retorno dividendos 2016-2021'!A:I,8,0)","v":0.1197869924},100177.82197860742,{"$f":"VLOOKUP(A5,'Retorno dividendos 2016-2021'!A:I,9,0)","v":0.11359388318599999},105639.49099575244]
["BBPO11","BB PROGRESSIVO II FII ","Agências",{"$f":"VLOOKUP(A6,'Retorno dividendos 2016-2021'!A:I,8,0)","v":0.1124062566},106755.62342318942,{"$f":"VLOOKUP(A6,'Retorno dividendos 2016-2021'!A:I,9,0)","v":9.0962370681999999E-2},131922.68308344131]
["BCFF11","BTG PACTUAL FUNDO DE FUNDOS FII ","Fundo de Fundos",{"$f":"VLOOKUP(A7,'Retorno dividendos 2016-2021'!A:I,8,0)","v":7.6492340680000007E-2},156878.45205575685,{"$f":"VLOOKUP(A7,'Retorno dividendos 2016-2021'!A:I,9,0)","v":7.6722651667999991E-2},156407.52423322515]
["BCIA11","BRADESCO CARTEIRA IMOBILIÁRIA ATIVA FII ","Fundo de Fundos",{"$f":"VLOOKUP(A8,'Retorno dividendos 2016-2021'!A:I,8,0)","v":8.3371514709999997E-2},143934.05279658016,{"$f":"VLOOKUP(A8,'Retorno dividendos 2016-2021'!A:I,9,0)","v":8.1384038867999997E-2},147449.0596302707]
["BCRI11","BANESTES RECEBÍVEIS IMOBILIÁRIOS FII ","Recebíveis",{"$f":"VLOOKUP(A9,'Retorno dividendos 2016-2021'!A:I,8,0)","v":0.10977539629999999},109314.11230988197,{"$f":"VLOOKUP(A9,'Retorno dividendos 2016-2021'!A:I,9,0)","v":9.3248148521999988E-2},128688.88219446894]
["BPFF11","BRASIL PLURAL ABSOLUTO FUNDO DE FUNDOS FII ","Fundo de Fundos",{"$f":"VLOOKUP(A10,'Retorno dividendos 2016-2021'!A:I,8,0)","v":8.4699095320000001E-2},141678.01857461446,{"$f":"VLOOKUP(A10,'Retorno dividendos 2016-2021'!A:I,9,0)","v":8.7140954036000001E-2},137707.92542668874]
{"$rows_left_out":88}
{"sheet":"Monte uma carteira de FIIs","index":4,"n_rows":362,"n_cols":7,"rows_kept":362,"cut":false,"hidden":false,"merged":[[21,2,21,4],[1,2,1,3],[0,2,0,4],[2,2,2,3],[3,2,3,3]]}
[null,null,"PREENCHA OS DADOS ABAIXO"]
[null,null,"1) Seu nome",null,"Seu Nome"]
[null,null,"2) Que valor você gostaria de investir inicialmente em uma carteira de FIIs?",null,15000]
[null,null,"3) Quanto você gostaria de receber de dividendos por mês com sua carteira de FIIs?",null,1000]
[]
[null,null,"Código do\nfundo","Nome do Fundo","Setor","Peso do fundo na carteira","Valor\n(investimento inicial)"]
[null,null,null,{"$f":"IFERROR(VLOOKUP($C7,'Retorno dividendos 2016-2021'!$A:$C,2,0),\"\")","v":""},{"$f":"IFERROR(VLOOKUP($C7,'Retorno dividendos 2016-2021'!$A:$C,3,0),\"\")","v":""},1,{"$f":"IF(F7=\"\",\"\",$E$3*F7)","v":15000}]
[null,null,null,{"$f":"IFERROR(VLOOKUP($C8,'Retorno dividendos 2016-2021'!$A:$C,2,0),\"\")","v":""},{"$f":"IFERROR(VLOOKUP($C8,'Retorno dividendos 2016-2021'!$A:$C,3,0),\"\")","v":""},null,{"$f":"IF(F8=\"\",\"\",$E$3*F8)","v":""}]
[null,null,null,{"$f":"IFERROR(VLOOKUP($C9,'Retorno dividendos 2016-2021'!$A:$C,2,0),\"\")","v":""},{"$f":"IFERROR(VLOOKUP($C9,'Retorno dividendos 2016-2021'!$A:$C,3,0),\"\")","v":""},null,""]
[null,null,null,{"$f":"IFERROR(VLOOKUP($C10,'Retorno dividendos 2016-2021'!$A:$C,2,0),\"\")","v":""},{"$f":"IFERROR(VLOOKUP($C10,'Retorno dividendos 2016-2021'!$A:$C,3,0),\"\")","v":""},null,""]
{"$rows_left_out":353}
{"sheet":"Confira os resultados","index":5,"n_rows":482,"n_cols":28,"rows_kept":482,"cut":false,"hidden":false,"merged":[[12,7,12,8],[0,1,0,5],[1,1,1,4],[2,1,2,4],[3,1,3,4],[6,1,6,4],[7,1,7,4],[4,1,4,4],[5,1,5,4]]}
[null,{"$f":"CONCATENATE('Monte uma carteira de FIIs'!E2,\", veja os detalhes da sua carteira de FIIs:\")","v":"Seu Nome, veja os detalhes da sua carteira de FIIs:"},null,null,null,null,null,null,null,null,null,null,null,null,null,null,null,null,"Ano","Valor Investido","Dividendo anual",null,null,null,null,null,"Mês Atual",{"$f":"MONTH(TODAY())","v":8}]
[null,"Seu investimento inicial foi de:",null,null,null,{"$f":"SUM(C12:C26)","v":15000},null,null,null,null,null,null,null,null,null,null,null,null,{"$f":"AB5","v":2021},{"$f":"'Monte uma carteira de FIIs'!E3+('Monte uma carteira de FIIs'!#REF!*'Confira os resultados'!AB1)","v":{"$error":"#REF!"}},{"$f":"T2*((AB3/12) * (12-AB1+1))","v":{"$error":"#REF!"}}]
[null,"Com esse investimento, em um ano, essa carteira de FIIs proporcionaria dividendos* de:",null,null,null,{"$f":"SUM(D12:D26)","v":0},null,null,null,null,null,null,null,null,null,null,null,null,{"$f":"IFERROR(IF(S2=$AB$6,\"\",S2+1),\"\")","v":""},{"$f":"IF(S3=\"\",\"\",T2+'Monte uma carteira de FIIs'!#REF!*12)","v":""},{"$f":"IFERROR(T3*$AB$3,\"\")","v":""},null,null,null,null,null,"Dividend Yield",{"$f":"SUM(AB9:AB23)","v":0}]
[null,"A taxa média de retorno com dividendos* da sua carteira de FIIs é de:",null,null,null,{"$f":"F3/F2","v":0},null,null,null,null,null,null,null,null,null,null,null,null,{"$f":"IFERROR(IF(S3=$AB$6,\"\",S3+1),\"\")","v":""},{"$f":"IF(S4=\"\",\"\",T3+'Monte uma carteira de FIIs'!#REF!*12)","v":""},{"$f":"IFERROR(T4*$AB$3,\"\")","v":""}]
[null,"Para ter renda de R$ 1.000 por mês com os dividendos* dessa carteira, você precisaria investir:",null,null,null,{"$f":"12000/F4","v":{"$error":"#DIV/0!"}},null,null,null,null,null,null,null,null,null,null,null,null,"",{"$f":"IF(S5=\"\",\"\",T4+'Monte uma carteira de FIIs'!#REF!*12)","v":""},"",null,null,null,null,null,"Ano Atual",{"$f":"YEAR(TODAY())","v":2021}]
[null,{"$f":"CONCATENATE(\"Para ter renda de R$ \",'Monte uma carteira de FIIs'!E4,\" por mês com os dividendos* dessa carteira, você precisaria investir: \")","v":"Para ter renda de R$ 1000 por mês com os dividendos* dessa carteira, você precisaria investir: "},null,null,null,{"$f":"Validação*12/'Confira os resultados'!F4","v":{"$error":"#DIV/0!"}},null,null,null,null,null,null,null,null,null,null,null,null,"",{"$f":"IF(S6=\"\",\"\",T5+'Monte uma carteira de FIIs'!#REF!*12)","v":""},"",null,null,null,null,null,"Ano Aposentadoria",{"$f":"AB5+'Monte uma carteira de FIIs'!#REF!","v":{"$error":"#REF!"}}]
[null,"A taxa Selic atual é de:",null,null,null,5.2499999999999998E-2,null,null,null,null,null,null,null,null,null,null,null,null,"",{"$f":"IF(S7=\"\",\"\",T6+'Monte uma carteira de FIIs'!#REF!*12)","v":""},""]
[null,"Portanto, em relação à Selic, a taxa de retorno com dividendos da sua carteira é:",null,null,null,{"$f":"IF(F4>F7,\"Maior\",IF(F4=F7,\"Equivalente\",\"Menor\"))","v":"Menor"},null,null,null,null,null,null,null,null,null,null,null,null,"",{"$f":"IF(S8=\"\",\"\",T7+'Monte uma carteira de FIIs'!#REF!*12)","v":""},""]
[null,"* Considera a taxa de retorno com dividendos (dividend yield) média anual entre junho de 2016 e junho de 2021",null,null,null,null,null,null,null,null,null,null,null,null,null,null,null,null,"",{"$f":"IF(S9=\"\",\"\",T8+'Monte uma carteira de FIIs'!#REF!*12)","v":""},"",null,null,null,null,null,null,{"$f":"IFERROR('Monte uma carteira de FIIs'!F7*'Confira os resultados'!F12,\"\")","v":""}]
[null,null,null,null,null,null,null,null,null,null,null,null,null,null,null,null,null,null,"",{"$f":"IF(S10=\"\",\"\",T9+'Monte uma carteira de FIIs'!#REF!*12)","v":""},"",null,null,null,null,null,null,{"$f":"IFERROR('Monte uma carteira de FIIs'!F8*'Confira os resultados'!F13,\"\")","v":""}]
{"$rows_left_out":473}
{"sheet":"Sheet1","index":6,"n_rows":99,"n_cols":7,"rows_kept":99,"cut":false,"hidden":true,"merged":[[0,2,0,6],[1,2,1,6]]}
["Nome","Ticker","Dividend Yield (Cotação Final)"]
["","","diária"]
["","","30/06/2016 até 30/06/2017","30/06/2017 até 30/06/2018","30/06/2018 até 30/06/2019","30/06/2019 até 30/06/2020","30/06/2020 até 30/06/2021"]
["ALIANZA TRUST RENDA IMOBILIÁRIA FII - ALZR11","ALZR11","","",7.5101816949999997E-2,4.7416945180000003E-2,5.3170138409999998E-2]
["BANESTES RECEBÍVEIS IMOBILIÁRIOS FII - BCRI11","BCRI11",0.1100588086,7.889432767E-2,8.3416887450000005E-2,8.4095322589999993E-2,0.10977539629999999]
["BARIGUI RENDIMENTOS IMOBILIÁRIOS I FII - BARI11","BARI11","","","","",0.1357894737]
["BB PROGRESSIVO FII - BBFI11B","BBFI11B",0.1015258123,0.13324499710000001,9.9584406530000003E-2,0.11382720759999999,0.1197869924]
["BB PROGRESSIVO II FII - BBPO11","BBPO11",8.5845440689999997E-2,9.5922262580000001E-2,8.3633841099999995E-2,7.7004052439999998E-2,0.1124062566]
["BRADESCO CARTEIRA IMOBILIÁRIA ATIVA FII - BCIA11","BCIA11",9.4003737680000005E-2,7.7767441859999994E-2,7.2699207340000002E-2,7.9078292750000001E-2,8.3371514709999997E-2]
["BRASIL PLURAL ABSOLUTO FUNDO DE FUNDOS FII - BPFF11","BPFF11",8.8529886909999994E-2,9.0593505039999994E-2,7.9376776499999996E-2,9.2505506409999994E-2,8.4699095320000001E-2]
{"$rows_left_out":90}
{"sheet":"Lista","index":7,"n_rows":97,"n_cols":7,"rows_kept":97,"cut":false,"hidden":true,"merged":[]}
[]
[null,null,null,null,"ABCP11",null,"Sim"]
[null,null,null,null,"ALZR11",null,"Não"]
[null,null,null,null,"BARI11"]
[null,null,null,null,"BBFI11B"]
[null,null,null,null,"BBPO11"]
[null,null,null,null,"BCFF11"]
[null,null,null,null,"BCIA11"]
[null,null,null,null,"BCRI11"]
[null,null,null,null,"BPFF11"]
{"$rows_left_out":87}